Sorry your browser is not supported!

You are using an outdated browser that does not support modern web technologies, in order to use this site please update to a new browser.

Browsers supported include Chrome, FireFox, Safari, Opera, Internet Explorer 10+ or Microsoft Edge.

Dark GDK / another link problem ...

Author
Message
Didou69
16
Years of Service
User Offline
Joined: 24th Oct 2003
Location: France
Posted: 7th Feb 2005 19:44 Edited at: 7th Feb 2005 19:50
I'm using vc 2003 .net and I get some error of link :

------ Build started: Project: w32, Configuration: Debug Win32 ------

Linking...
fd.obj : error LNK2001: unresolved external symbol __RTC_Shutdown
fd.obj : error LNK2001: unresolved external symbol __RTC_InitBase
LINK : error LNK2001: unresolved external symbol _WinMainCRTStartup
Debug/w32.exe : fatal error LNK1120: 3 unresolved externals

Build log was saved at "file://cocuments and Settingsdidou69Mes documentsVisual Studio Projectsw32DebugBuildLog.htm"
w32 - 4 error(s), 0 warning(s)


---------------------- Done ----------------------

Build: 0 succeeded, 1 failed, 0 skipped

Somebody can help me?

PS: I've installed DX9 Extras - I set up DX9SDK and DG SDK directory like is describe in DG SDK documentation...
OSX Using Happy Dude
16
Years of Service
User Offline
Joined: 21st Aug 2003
Location: At home
Posted: 8th Feb 2005 05:38
Using Win32 Project in release mode ?

Visit http://homepages.nildram.co.uk/~nickk/
Questions are a burden to others, answers a prison for oneself.
Didou69
16
Years of Service
User Offline
Joined: 24th Oct 2003
Location: France
Posted: 8th Feb 2005 05:58 Edited at: 8th Feb 2005 05:58
yes I test debug mode and relase mode but i have this error in release mode :

------ Build started: Project: w32, Configuration: Release Win32 ------

Linking...
LINK : error LNK2001: unresolved external symbol _WinMainCRTStartup
Release/w32.exe : fatal error LNK1120: 1 unresolved externals

Build log was saved at "file://cocuments and Settingsdidou69Mes documentsVisual Studio Projectsw32ReleaseBuildLog.htm"
w32 - 2 error(s), 0 warning(s)


---------------------- Done ----------------------

Build: 0 succeeded, 1 failed, 0 skipped

do you know the problem? it's make crazy !!!
OSX Using Happy Dude
16
Years of Service
User Offline
Joined: 21st Aug 2003
Location: At home
Posted: 8th Feb 2005 06:01 Edited at: 8th Feb 2005 06:02
Send me the project - and I can have a look at it.
I think I know the problem, but cant verify it until I see the code.

Visit http://homepages.nildram.co.uk/~nickk/
Questions are a burden to others, answers a prison for oneself.
Didou69
16
Years of Service
User Offline
Joined: 24th Oct 2003
Location: France
Posted: 8th Feb 2005 06:12 Edited at: 8th Feb 2005 06:12
I prepare you a zip with screenshot of project property and the project :it's a simple empty loop just to test if the engine start ...
Didou69
16
Years of Service
User Offline
Joined: 24th Oct 2003
Location: France
Posted: 8th Feb 2005 06:33 Edited at: 8th Feb 2005 06:34
it's ready i mailed you the project and screenshots ...
Didou69
16
Years of Service
User Offline
Joined: 24th Oct 2003
Location: France
Posted: 8th Feb 2005 06:59 Edited at: 8th Feb 2005 07:02
I try to compile one project you put in your website (Loads of 3D Objects) and i can compile it !!!

A white window appear but I get this :

'Lots of fast 3D.exe': Loaded 'Cocuments and Settingsdidou69BureauNouveau dossier (2)ReleaseLots of fast 3D.exe', Symbols loaded.
'Lots of fast 3D.exe': Loaded 'C:WINDOWSsystem32ntdll.dll', No symbols loaded.
'Lots of fast 3D.exe': Loaded 'C:WINDOWSsystem32kernel32.dll', No symbols loaded.
'Lots of fast 3D.exe': Loaded 'C:WINDOWSsystem32d3d9.dll', No symbols loaded.
'Lots of fast 3D.exe': Loaded 'C:WINDOWSsystem32d3d8thk.dll', No symbols loaded.
'Lots of fast 3D.exe': Loaded 'C:WINDOWSsystem32gdi32.dll', No symbols loaded.
'Lots of fast 3D.exe': Loaded 'C:WINDOWSsystem32user32.dll', No symbols loaded.
'Lots of fast 3D.exe': Loaded 'C:WINDOWSsystem32advapi32.dll', No symbols loaded.
'Lots of fast 3D.exe': Loaded 'C:WINDOWSsystem32rpcrt4.dll', No symbols loaded.
'Lots of fast 3D.exe': Loaded 'C:WINDOWSsystem32msvcrt.dll', No symbols loaded.
'Lots of fast 3D.exe': Loaded 'C:WINDOWSsystem32version.dll', No symbols loaded.
'Lots of fast 3D.exe': Loaded 'C:WINDOWSsystem32winmm.dll', No symbols loaded.
'Lots of fast 3D.exe': Loaded 'C:WINDOWSsystem32dinput8.dll', No symbols loaded.
'Lots of fast 3D.exe': Loaded 'C:WINDOWSsystem32d3dxof.dll', No symbols loaded.
'Lots of fast 3D.exe': Loaded 'C:WINDOWSsystem32ole32.dll', No symbols loaded.
'Lots of fast 3D.exe': Loaded 'C:WINDOWSsystem32dsound.dll', No symbols loaded.
'Lots of fast 3D.exe': Loaded 'C:WINDOWSsystem32wininet.dll', No symbols loaded.
'Lots of fast 3D.exe': Loaded 'C:WINDOWSsystem32SHLWAPI.DLL', No symbols loaded.
'Lots of fast 3D.exe': Loaded 'C:WINDOWSsystem32crypt32.dll', No symbols loaded.
'Lots of fast 3D.exe': Loaded 'C:WINDOWSsystem32msasn1.dll', No symbols loaded.
'Lots of fast 3D.exe': Loaded 'C:WINDOWSsystem32oleaut32.dll', No symbols loaded.
'Lots of fast 3D.exe': Loaded 'C:WINDOWSsystem32dplayx.dll', No symbols loaded.
'Lots of fast 3D.exe': Loaded 'C:WINDOWSsystem32shell32.dll', No symbols loaded.
'Lots of fast 3D.exe': Loaded 'C:WINDOWSWinSxSx86_Microsoft.Windows.Common-Controls_6595b64144ccf1df_6.0.10.0_x-ww_f7fb5805comctl32.dll', No symbols loaded.
'Lots of fast 3D.exe': Loaded 'C:WINDOWSsystem32comctl32.dll', No symbols loaded.
'Lots of fast 3D.exe': Loaded 'C:WINDOWSsystem32MSCTF.dll', No symbols loaded.
'Lots of fast 3D.exe': Loaded 'Crogram FilesLogitechMouseWaresystemLgWndHk.dll', No symbols loaded.
'Lots of fast 3D.exe': Loaded 'C:WINDOWSsystem32hid.dll', No symbols loaded.
'Lots of fast 3D.exe': Loaded 'C:WINDOWSsystem32setupapi.dll', No symbols loaded.
'Lots of fast 3D.exe': Loaded 'C:WINDOWSsystem32ntmarta.dll', No symbols loaded.
'Lots of fast 3D.exe': Loaded 'C:WINDOWSsystem32wldap32.dll', No symbols loaded.
'Lots of fast 3D.exe': Loaded 'C:WINDOWSsystem32samlib.dll', No symbols loaded.
'Lots of fast 3D.exe': Loaded 'Crogram FilesFichiers communsLogitechScrollingLGMSGHK.DLL', No symbols loaded.
'Lots of fast 3D.exe': Loaded 'C:WINDOWSsystem32msvcp60.dll', No symbols loaded.
'Lots of fast 3D.exe': Loaded 'C:WINDOWSsystem32wdmaud.drv', No symbols loaded.
'Lots of fast 3D.exe': Loaded 'C:WINDOWSsystem32msacm32.drv', No symbols loaded.
'Lots of fast 3D.exe': Loaded 'C:WINDOWSsystem32msacm32.dll', No symbols loaded.
'Lots of fast 3D.exe': Loaded 'C:WINDOWSsystem32midimap.dll', No symbols loaded.
'Lots of fast 3D.exe': Loaded 'C:WINDOWSsystem32ksuser.dll', No symbols loaded.
'Lots of fast 3D.exe': Loaded 'C:WINDOWSsystem32clbcatq.dll', No symbols loaded.
'Lots of fast 3D.exe': Loaded 'C:WINDOWSsystem32comres.dll', No symbols loaded.
'Lots of fast 3D.exe': Loaded 'C:WINDOWSsystem32quartz.dll', No symbols loaded.
The thread 'Win32 Thread' (0xab4) has exited with code 0 (0x0).
The thread 'Win32 Thread' (0x724) has exited with code 0 (0x0).
The thread 'Win32 Thread' (0x9a8) has exited with code 0 (0x0).
The thread 'Win32 Thread' (0x5c4) has exited with code 0 (0x0).
The thread 'Win32 Thread' (0xd78) has exited with code 0 (0x0).
The thread 'Win32 Thread' (0xbfc) has exited with code 0 (0x0).
The thread 'Win32 Thread' (0xbc8) has exited with code 0 (0x0).
The thread 'Win32 Thread' (0xf84) has exited with code 0 (0x0).
The program '[3336] Lots of fast 3D.exe: Native' has exited with code 0 (0x0).

the problem can come of my DLL files?
OSX Using Happy Dude
16
Years of Service
User Offline
Joined: 21st Aug 2003
Location: At home
Posted: 8th Feb 2005 19:03
I've sent you a new project back. What I think has happened is that originally the project was an MFC one, and was changed to Win32. Unfortunately (whether its a bug or not), some bits of the MFC setup are still in the project, resulting in the compiler error.

Visit http://homepages.nildram.co.uk/~nickk/
Questions are a burden to others, answers a prison for oneself.
Didou69
16
Years of Service
User Offline
Joined: 24th Oct 2003
Location: France
Posted: 8th Feb 2005 20:34
I compile correctly with your project thanks you for your precious help.

i put it here to help another person with same problem.
you can make an project base with it.

Attachments

Login to view attachments

Login to post a reply

Server time is: 2019-12-10 15:33:49
Your offset time is: 2019-12-10 15:33:49